{"text_format":"1","workbook":"xlsx","n_sheets":3,"sheets":["Hole Survey","Calculator","Read Me"],"not_rendered":{"charts":0,"images":0,"macros":1,"external_links":0,"defined_names":1,"comments":0,"pivot_tables":0},"unopened":[],"bounds":{"document_bytes":16777216,"sheet_cells":100000,"rows_first":2000,"rows_last":500,"rows_between":2000,"halvings":0,"cell_chars":16384,"cell_head_chars":4096},"cells_cut":0,"cells_raw":0,"read":"whole","date_system":"1900"}

{"sheet":"Hole Survey","index":0,"n_rows":4,"n_cols":3,"rows_kept":4,"cut":false,"hidden":false,"merged":[[3,0,4,0],[3,1,4,1],[3,2,4,2],[2,0,2,2]]}
["Hole Survey: Input survey data here to be matched with point structures."]
["Measured structures will be assigned the inclination/trend from the nearest survey point."]
["Input Hole Survey Data"]
["Depth","Hole Inclination","Hole Trend"]

{"sheet":"Calculator","index":1,"n_rows":508,"n_cols":36,"rows_kept":508,"cut":false,"hidden":false,"merged":[[1,0,1,11],[6,12,6,35],[6,0,6,4],[6,5,6,11]]}
["Oriented Core: Alpha-Beta-Gamma  to  Dip / Dip-Azimuth / Trend / Plunge"]
["Enter inputs in the Green columns (B-E). Hole survey data should be entered into the \"Hole Survey\" sheet. Structures will be assigned the nearest hole survey. Type one row or paste a whole table starting at row 9. Outputs recalculate automatically. The Warnings column (red when triggered) flags any input outside its expected range - the calculation still runs, this is a data-entry check. Helper columns for the calculation (L-AK) are hidden to the right of the output columns."]
["Gamma Convention: Use Beta as 0 point!",null,null,null,null,"Orientation Line Convention: Line is BOTTOM OF HOLE!!"]
["Settings"]
["Beta sense (1 = CW looking down-hole, -1 = CCW)",null,null,null,null,1]
["Gamma sense (1 = CW looking down-hole, -1 = CCW)",null,null,null,null,1]
["INPUT COLUMNS : PASTE DATA BELOW",null,null,null,null,"OUTPUT COLUMNS : DO NOT OVERWRITE!!!!",null,null,null,null,null,null,"HELPER COLUMNS: DO NOT OVERWRITE!!!!"]
["ID","Depth","Alpha ","Beta","Gamma ","Hole Trend ","Hole Inclination (-down/+up)","Dip ","Dip Azimuth ","Lineation Trend ","Lineation Plunge ","Warnings","aE","aN","aU","bE","bN","bU","cE","cN","cU","pE","pN","pU","sP","g1E","g1N","g1U","g2E","g2N","g2U","LE","LN","LU","sL","rawwarn"]
[null,null,null,null,null,{"$f":"IF($B9=\"\",\"\",INDEX('Hole Survey'!$C$6:$C$105,MATCH(MIN(ABS(IF('Hole Survey'!$A$6:$A$105=\"\",1E+99,'Hole Survey'!$A$6:$A$105)-$B9)),ABS(IF('Hole Survey'!$A$6:$A$105=\"\",1E+99,'Hole Survey'!$A$6:$A$105)-$B9),0)))","v":""},{"$f":"IF($B9=\"\",\"\",INDEX('Hole Survey'!$B$6:$B$105,MATCH(MIN(ABS(IF('Hole Survey'!$A$6:$A$105=\"\",1E+99,'Hole Survey'!$A$6:$A$105)-$B9)),ABS(IF('Hole Survey'!$A$6:$A$105=\"\",1E+99,'Hole Survey'!$A$6:$A$105)-$B9),0)))","v":""},{"$f":"IF(C9=\"\",\"\",IFERROR(DEGREES(ACOS(MEDIAN(-1,1,Y9*X9))),\"\"))","v":""},{"$f":"IF(C9=\"\",\"\",IFERROR(MOD(DEGREES(ATAN2(Y9*W9,Y9*V9)),360),\"\"))","v":""},{"$f":"IF(OR(C9=\"\",E9=\"\"),\"\",IFERROR(MOD(DEGREES(ATAN2(AI9*AG9,AI9*AF9)),360),\"\"))","v":""},{"$f":"IF(OR(C9=\"\",E9=\"\"),\"\",IFERROR(DEGREES(ASIN(MEDIAN(-1,1,-AI9*AH9))),\"\"))","v":""},{"$f":"IF(C9=\"\",\"\",IF(AJ9=\"\",\"\",IF(RIGHT(AJ9,2)=\"; \",LEFT(AJ9,LEN(AJ9)-2),AJ9)))","v":""},{"$f":"COS(RADIANS(-G9))*SIN(RADIANS(F9))","v":{"$error":"#VALUE!"}},{"$f":"COS(RADIANS(-G9))*COS(RADIANS(F9))","v":{"$error":"#VALUE!"}},{"$f":"-SIN(RADIANS(-G9))","v":{"$error":"#VALUE!"}},{"$f":"-SIN(RADIANS(-G9))*SIN(RADIANS(F9))","v":{"$error":"#VALUE!"}},{"$f":"-SIN(RADIANS(-G9))*COS(RADIANS(F9))","v":{"$error":"#VALUE!"}},{"$f":"-COS(RADIANS(-G9))","v":{"$error":"#VALUE!"}},{"$f":"N9*R9-O9*Q9","v":{"$error":"#VALUE!"}},{"$f":"O9*P9-M9*R9","v":{"$error":"#VALUE!"}},{"$f":"M9*Q9-N9*P9","v":{"$error":"#VALUE!"}},{"$f":"-SIN(RADIANS(C9))*M9+COS(RADIANS(C9))*COS(RADIANS(D9*$F$5))*P9+COS(RADIANS(C9))*SIN(RADIANS(D9*$F$5))*S9","v":{"$error":"#VALUE!"}},{"$f":"-SIN(RADIANS(C9))*N9+COS(RADIANS(C9))*COS(RADIANS(D9*$F$5))*Q9+COS(RADIANS(C9))*SIN(RADIANS(D9*$F$5))*T9","v":{"$error":"#VALUE!"}},{"$f":"-SIN(RADIANS(C9))*O9+COS(RADIANS(C9))*COS(RADIANS(D9*$F$5))*R9+COS(RADIANS(C9))*SIN(RADIANS(D9*$F$5))*U9","v":{"$error":"#VALUE!"}},{"$f":"IF(X9<0,-1,1)","v":{"$error":"#VALUE!"}},{"$f":"COS(RADIANS(C9))*M9+SIN(RADIANS(C9))*(COS(RADIANS(D9*$F$5))*P9+SIN(RADIANS(D9*$F$5))*S9)","v":{"$error":"#VALUE!"}},{"$f":"COS(RADIANS(C9))*N9+SIN(RADIANS(C9))*(COS(RADIANS(D9*$F$5))*Q9+SIN(RADIANS(D9*$F$5))*T9)","v":{"$error":"#VALUE!"}},{"$f":"COS(RADIANS(C9))*O9+SIN(RADIANS(C9))*(COS(RADIANS(D9*$F$5))*R9+SIN(RADIANS(D9*$F$5))*U9)","v":{"$error":"#VALUE!"}},{"$f":"-SIN(RADIANS(D9*$F$5))*P9+COS(RADIANS(D9*$F$5))*S9","v":{"$error":"#VALUE!"}},{"$f":"-SIN(RADIANS(D9*$F$5))*Q9+COS(RADIANS(D9*$F$5))*T9","v":{"$error":"#VALUE!"}},{"$f":"-SIN(RADIANS(D9*$F$5))*R9+COS(RADIANS(D9*$F$5))*U9","v":{"$error":"#VALUE!"}},{"$f":"COS(RADIANS(E9*$F$6))*Z9+SIN(RADIANS(E9*$F$6))*AC9","v":{"$error":"#VALUE!"}},{"$f":"COS(RADIANS(E9*$F$6))*AA9+SIN(RADIANS(E9*$F$6))*AD9","v":{"$error":"#VALUE!"}},{"$f":"COS(RADIANS(E9*$F$6))*AB9+SIN(RADIANS(E9*$F$6))*AE9","v":{"$error":"#VALUE!"}},{"$f":"IF(AH9>0,-1,1)","v":{"$error":"#VALUE!"}},{"$f":"IF(OR(C9<0,C9>90),\"Alpha out of range (0-90); \",\"\")&IF(OR(D9<0,D9>=360),\"Beta out of range (0-359); \",\"\")&IF(AND(E9<>\"\",OR(E9<0,E9>=360)),\"Gamma out of range (0-359); \",\"\")&IF(OR(F9<0,F9>=360),\"Hole trend out of range (0-359); \",\"\")&IF(OR(G9<-90,G9>90),\"Hole inclination out of range (-90 to 90); \",\"\")","v":"Hole trend out of range (0-359); Hole inclination out of range (-90 to 90); "}]
[null,null,null,null,null,{"$f":"IF($B10=\"\",\"\",INDEX('Hole Survey'!$C$6:$C$105,MATCH(MIN(ABS(IF('Hole Survey'!$A$6:$A$105=\"\",1E+99,'Hole Survey'!$A$6:$A$105)-$B10)),ABS(IF('Hole Survey'!$A$6:$A$105=\"\",1E+99,'Hole Survey'!$A$6:$A$105)-$B10),0)))","v":""},{"$f":"IF($B10=\"\",\"\",INDEX('Hole Survey'!$B$6:$B$105,MATCH(MIN(ABS(IF('Hole Survey'!$A$6:$A$105=\"\",1E+99,'Hole Survey'!$A$6:$A$105)-$B10)),ABS(IF('Hole Survey'!$A$6:$A$105=\"\",1E+99,'Hole Survey'!$A$6:$A$105)-$B10),0)))","v":""},"","","","","",{"$error":"#VALUE!"},{"$error":"#VALUE!"},{"$error":"#VALUE!"},{"$error":"#VALUE!"},{"$error":"#VALUE!"},{"$error":"#VALUE!"},{"$error":"#VALUE!"},{"$error":"#VALUE!"},{"$error":"#VALUE!"},{"$error":"#VALUE!"},{"$error":"#VALUE!"},{"$error":"#VALUE!"},{"$error":"#VALUE!"},{"$error":"#VALUE!"},{"$error":"#VALUE!"},{"$error":"#VALUE!"},{"$error":"#VALUE!"},{"$error":"#VALUE!"},{"$error":"#VALUE!"},{"$error":"#VALUE!"},{"$error":"#VALUE!"},{"$error":"#VALUE!"},{"$error":"#VALUE!"},"Hole trend out of range (0-359); Hole inclination out of range (-90 to 90); "]
[null,null,null,null,null,{"$f":"IF($B11=\"\",\"\",INDEX('Hole Survey'!$C$6:$C$105,MATCH(MIN(ABS(IF('Hole Survey'!$A$6:$A$105=\"\",1E+99,'Hole Survey'!$A$6:$A$105)-$B11)),ABS(IF('Hole Survey'!$A$6:$A$105=\"\",1E+99,'Hole Survey'!$A$6:$A$105)-$B11),0)))","v":""},{"$f":"IF($B11=\"\",\"\",INDEX('Hole Survey'!$B$6:$B$105,MATCH(MIN(ABS(IF('Hole Survey'!$A$6:$A$105=\"\",1E+99,'Hole Survey'!$A$6:$A$105)-$B11)),ABS(IF('Hole Survey'!$A$6:$A$105=\"\",1E+99,'Hole Survey'!$A$6:$A$105)-$B11),0)))","v":""},"","","","","",{"$error":"#VALUE!"},{"$error":"#VALUE!"},{"$error":"#VALUE!"},{"$error":"#VALUE!"},{"$error":"#VALUE!"},{"$error":"#VALUE!"},{"$error":"#VALUE!"},{"$error":"#VALUE!"},{"$error":"#VALUE!"},{"$error":"#VALUE!"},{"$error":"#VALUE!"},{"$error":"#VALUE!"},{"$error":"#VALUE!"},{"$error":"#VALUE!"},{"$error":"#VALUE!"},{"$error":"#VALUE!"},{"$error":"#VALUE!"},{"$error":"#VALUE!"},{"$error":"#VALUE!"},{"$error":"#VALUE!"},{"$error":"#VALUE!"},{"$error":"#VALUE!"},{"$error":"#VALUE!"},"Hole trend out of range (0-359); Hole inclination out of range (-90 to 90); "]
[null,null,null,null,null,{"$f":"IF($B12=\"\",\"\",INDEX('Hole Survey'!$C$6:$C$105,MATCH(MIN(ABS(IF('Hole Survey'!$A$6:$A$105=\"\",1E+99,'Hole Survey'!$A$6:$A$105)-$B12)),ABS(IF('Hole Survey'!$A$6:$A$105=\"\",1E+99,'Hole Survey'!$A$6:$A$105)-$B12),0)))","v":""},{"$f":"IF($B12=\"\",\"\",INDEX('Hole Survey'!$B$6:$B$105,MATCH(MIN(ABS(IF('Hole Survey'!$A$6:$A$105=\"\",1E+99,'Hole Survey'!$A$6:$A$105)-$B12)),ABS(IF('Hole Survey'!$A$6:$A$105=\"\",1E+99,'Hole Survey'!$A$6:$A$105)-$B12),0)))","v":""},"","","","","",{"$error":"#VALUE!"},{"$error":"#VALUE!"},{"$error":"#VALUE!"},{"$error":"#VALUE!"},{"$error":"#VALUE!"},{"$error":"#VALUE!"},{"$error":"#VALUE!"},{"$error":"#VALUE!"},{"$error":"#VALUE!"},{"$error":"#VALUE!"},{"$error":"#VALUE!"},{"$error":"#VALUE!"},{"$error":"#VALUE!"},{"$error":"#VALUE!"},{"$error":"#VALUE!"},{"$error":"#VALUE!"},{"$error":"#VALUE!"},{"$error":"#VALUE!"},{"$error":"#VALUE!"},{"$error":"#VALUE!"},{"$error":"#VALUE!"},{"$error":"#VALUE!"},{"$error":"#VALUE!"},"Hole trend out of range (0-359); Hole inclination out of range (-90 to 90); "]
[null,null,null,null,null,{"$f":"IF($B13=\"\",\"\",INDEX('Hole Survey'!$C$6:$C$105,MATCH(MIN(ABS(IF('Hole Survey'!$A$6:$A$105=\"\",1E+99,'Hole Survey'!$A$6:$A$105)-$B13)),ABS(IF('Hole Survey'!$A$6:$A$105=\"\",1E+99,'Hole Survey'!$A$6:$A$105)-$B13),0)))","v":""},{"$f":"IF($B13=\"\",\"\",INDEX('Hole Survey'!$B$6:$B$105,MATCH(MIN(ABS(IF('Hole Survey'!$A$6:$A$105=\"\",1E+99,'Hole Survey'!$A$6:$A$105)-$B13)),ABS(IF('Hole Survey'!$A$6:$A$105=\"\",1E+99,'Hole Survey'!$A$6:$A$105)-$B13),0)))","v":""},"","","","","",{"$error":"#VALUE!"},{"$error":"#VALUE!"},{"$error":"#VALUE!"},{"$error":"#VALUE!"},{"$error":"#VALUE!"},{"$error":"#VALUE!"},{"$error":"#VALUE!"},{"$error":"#VALUE!"},{"$error":"#VALUE!"},{"$error":"#VALUE!"},{"$error":"#VALUE!"},{"$error":"#VALUE!"},{"$error":"#VALUE!"},{"$error":"#VALUE!"},{"$error":"#VALUE!"},{"$error":"#VALUE!"},{"$error":"#VALUE!"},{"$error":"#VALUE!"},{"$error":"#VALUE!"},{"$error":"#VALUE!"},{"$error":"#VALUE!"},{"$error":"#VALUE!"},{"$error":"#VALUE!"},"Hole trend out of range (0-359); Hole inclination out of range (-90 to 90); "]
[null,null,null,null,null,{"$f":"IF($B14=\"\",\"\",INDEX('Hole Survey'!$C$6:$C$105,MATCH(MIN(ABS(IF('Hole Survey'!$A$6:$A$105=\"\",1E+99,'Hole Survey'!$A$6:$A$105)-$B14)),ABS(IF('Hole Survey'!$A$6:$A$105=\"\",1E+99,'Hole Survey'!$A$6:$A$105)-$B14),0)))","v":""},{"$f":"IF($B14=\"\",\"\",INDEX('Hole Survey'!$B$6:$B$105,MATCH(MIN(ABS(IF('Hole Survey'!$A$6:$A$105=\"\",1E+99,'Hole Survey'!$A$6:$A$105)-$B14)),ABS(IF('Hole Survey'!$A$6:$A$105=\"\",1E+99,'Hole Survey'!$A$6:$A$105)-$B14),0)))","v":""},"","","","","",{"$error":"#VALUE!"},{"$error":"#VALUE!"},{"$error":"#VALUE!"},{"$error":"#VALUE!"},{"$error":"#VALUE!"},{"$error":"#VALUE!"},{"$error":"#VALUE!"},{"$error":"#VALUE!"},{"$error":"#VALUE!"},{"$error":"#VALUE!"},{"$error":"#VALUE!"},{"$error":"#VALUE!"},{"$error":"#VALUE!"},{"$error":"#VALUE!"},{"$error":"#VALUE!"},{"$error":"#VALUE!"},{"$error":"#VALUE!"},{"$error":"#VALUE!"},{"$error":"#VALUE!"},{"$error":"#VALUE!"},{"$error":"#VALUE!"},{"$error":"#VALUE!"},{"$error":"#VALUE!"},"Hole trend out of range (0-359); Hole inclination out of range (-90 to 90); "]
[null,null,null,null,null,{"$f":"IF($B15=\"\",\"\",INDEX('Hole Survey'!$C$6:$C$105,MATCH(MIN(ABS(IF('Hole Survey'!$A$6:$A$105=\"\",1E+99,'Hole Survey'!$A$6:$A$105)-$B15)),ABS(IF('Hole Survey'!$A$6:$A$105=\"\",1E+99,'Hole Survey'!$A$6:$A$105)-$B15),0)))","v":""},{"$f":"IF($B15=\"\",\"\",INDEX('Hole Survey'!$B$6:$B$105,MATCH(MIN(ABS(IF('Hole Survey'!$A$6:$A$105=\"\",1E+99,'Hole Survey'!$A$6:$A$105)-$B15)),ABS(IF('Hole Survey'!$A$6:$A$105=\"\",1E+99,'Hole Survey'!$A$6:$A$105)-$B15),0)))","v":""},"","","","","",{"$error":"#VALUE!"},{"$error":"#VALUE!"},{"$error":"#VALUE!"},{"$error":"#VALUE!"},{"$error":"#VALUE!"},{"$error":"#VALUE!"},{"$error":"#VALUE!"},{"$error":"#VALUE!"},{"$error":"#VALUE!"},{"$error":"#VALUE!"},{"$error":"#VALUE!"},{"$error":"#VALUE!"},{"$error":"#VALUE!"},{"$error":"#VALUE!"},{"$error":"#VALUE!"},{"$error":"#VALUE!"},{"$error":"#VALUE!"},{"$error":"#VALUE!"},{"$error":"#VALUE!"},{"$error":"#VALUE!"},{"$error":"#VALUE!"},{"$error":"#VALUE!"},{"$error":"#VALUE!"},"Hole trend out of range (0-359); Hole inclination out of range (-90 to 90); "]
[null,null,null,null,null,{"$f":"IF($B16=\"\",\"\",INDEX('Hole Survey'!$C$6:$C$105,MATCH(MIN(ABS(IF('Hole Survey'!$A$6:$A$105=\"\",1E+99,'Hole Survey'!$A$6:$A$105)-$B16)),ABS(IF('Hole Survey'!$A$6:$A$105=\"\",1E+99,'Hole Survey'!$A$6:$A$105)-$B16),0)))","v":""},{"$f":"IF($B16=\"\",\"\",INDEX('Hole Survey'!$B$6:$B$105,MATCH(MIN(ABS(IF('Hole Survey'!$A$6:$A$105=\"\",1E+99,'Hole Survey'!$A$6:$A$105)-$B16)),ABS(IF('Hole Survey'!$A$6:$A$105=\"\",1E+99,'Hole Survey'!$A$6:$A$105)-$B16),0)))","v":""},"","","","","",{"$error":"#VALUE!"},{"$error":"#VALUE!"},{"$error":"#VALUE!"},{"$error":"#VALUE!"},{"$error":"#VALUE!"},{"$error":"#VALUE!"},{"$error":"#VALUE!"},{"$error":"#VALUE!"},{"$error":"#VALUE!"},{"$error":"#VALUE!"},{"$error":"#VALUE!"},{"$error":"#VALUE!"},{"$error":"#VALUE!"},{"$error":"#VALUE!"},{"$error":"#VALUE!"},{"$error":"#VALUE!"},{"$error":"#VALUE!"},{"$error":"#VALUE!"},{"$error":"#VALUE!"},{"$error":"#VALUE!"},{"$error":"#VALUE!"},{"$error":"#VALUE!"},{"$error":"#VALUE!"},"Hole trend out of range (0-359); Hole inclination out of range (-90 to 90); "]
[null,null,null,null,null,{"$f":"IF($B17=\"\",\"\",INDEX('Hole Survey'!$C$6:$C$105,MATCH(MIN(ABS(IF('Hole Survey'!$A$6:$A$105=\"\",1E+99,'Hole Survey'!$A$6:$A$105)-$B17)),ABS(IF('Hole Survey'!$A$6:$A$105=\"\",1E+99,'Hole Survey'!$A$6:$A$105)-$B17),0)))","v":""},{"$f":"IF($B17=\"\",\"\",INDEX('Hole Survey'!$B$6:$B$105,MATCH(MIN(ABS(IF('Hole Survey'!$A$6:$A$105=\"\",1E+99,'Hole Survey'!$A$6:$A$105)-$B17)),ABS(IF('Hole Survey'!$A$6:$A$105=\"\",1E+99,'Hole Survey'!$A$6:$A$105)-$B17),0)))","v":""},"","","","","",{"$error":"#VALUE!"},{"$error":"#VALUE!"},{"$error":"#VALUE!"},{"$error":"#VALUE!"},{"$error":"#VALUE!"},{"$error":"#VALUE!"},{"$error":"#VALUE!"},{"$error":"#VALUE!"},{"$error":"#VALUE!"},{"$error":"#VALUE!"},{"$error":"#VALUE!"},{"$error":"#VALUE!"},{"$error":"#VALUE!"},{"$error":"#VALUE!"},{"$error":"#VALUE!"},{"$error":"#VALUE!"},{"$error":"#VALUE!"},{"$error":"#VALUE!"},{"$error":"#VALUE!"},{"$error":"#VALUE!"},{"$error":"#VALUE!"},{"$error":"#VALUE!"},{"$error":"#VALUE!"},"Hole trend out of range (0-359); Hole inclination out of range (-90 to 90); "]
[null,null,null,null,null,{"$f":"IF($B18=\"\",\"\",INDEX('Hole Survey'!$C$6:$C$105,MATCH(MIN(ABS(IF('Hole Survey'!$A$6:$A$105=\"\",1E+99,'Hole Survey'!$A$6:$A$105)-$B18)),ABS(IF('Hole Survey'!$A$6:$A$105=\"\",1E+99,'Hole Survey'!$A$6:$A$105)-$B18),0)))","v":""},{"$f":"IF($B18=\"\",\"\",INDEX('Hole Survey'!$B$6:$B$105,MATCH(MIN(ABS(IF('Hole Survey'!$A$6:$A$105=\"\",1E+99,'Hole Survey'!$A$6:$A$105)-$B18)),ABS(IF('Hole Survey'!$A$6:$A$105=\"\",1E+99,'Hole Survey'!$A$6:$A$105)-$B18),0)))","v":""},"","","","","",{"$error":"#VALUE!"},{"$error":"#VALUE!"},{"$error":"#VALUE!"},{"$error":"#VALUE!"},{"$error":"#VALUE!"},{"$error":"#VALUE!"},{"$error":"#VALUE!"},{"$error":"#VALUE!"},{"$error":"#VALUE!"},{"$error":"#VALUE!"},{"$error":"#VALUE!"},{"$error":"#VALUE!"},{"$error":"#VALUE!"},{"$error":"#VALUE!"},{"$error":"#VALUE!"},{"$error":"#VALUE!"},{"$error":"#VALUE!"},{"$error":"#VALUE!"},{"$error":"#VALUE!"},{"$error":"#VALUE!"},{"$error":"#VALUE!"},{"$error":"#VALUE!"},{"$error":"#VALUE!"},"Hole trend out of range (0-359); Hole inclination out of range (-90 to 90); "]
[null,null,null,null,null,{"$f":"IF($B19=\"\",\"\",INDEX('Hole Survey'!$C$6:$C$105,MATCH(MIN(ABS(IF('Hole Survey'!$A$6:$A$105=\"\",1E+99,'Hole Survey'!$A$6:$A$105)-$B19)),ABS(IF('Hole Survey'!$A$6:$A$105=\"\",1E+99,'Hole Survey'!$A$6:$A$105)-$B19),0)))","v":""},{"$f":"IF($B19=\"\",\"\",INDEX('Hole Survey'!$B$6:$B$105,MATCH(MIN(ABS(IF('Hole Survey'!$A$6:$A$105=\"\",1E+99,'Hole Survey'!$A$6:$A$105)-$B19)),ABS(IF('Hole Survey'!$A$6:$A$105=\"\",1E+99,'Hole Survey'!$A$6:$A$105)-$B19),0)))","v":""},"","","","","",{"$error":"#VALUE!"},{"$error":"#VALUE!"},{"$error":"#VALUE!"},{"$error":"#VALUE!"},{"$error":"#VALUE!"},{"$error":"#VALUE!"},{"$error":"#VALUE!"},{"$error":"#VALUE!"},{"$error":"#VALUE!"},{"$error":"#VALUE!"},{"$error":"#VALUE!"},{"$error":"#VALUE!"},{"$error":"#VALUE!"},{"$error":"#VALUE!"},{"$error":"#VALUE!"},{"$error":"#VALUE!"},{"$error":"#VALUE!"},{"$error":"#VALUE!"},{"$error":"#VALUE!"},{"$error":"#VALUE!"},{"$error":"#VALUE!"},{"$error":"#VALUE!"},{"$error":"#VALUE!"},"Hole trend out of range (0-359); Hole inclination out of range (-90 to 90); "]
[null,null,null,null,null,{"$f":"IF($B20=\"\",\"\",INDEX('Hole Survey'!$C$6:$C$105,MATCH(MIN(ABS(IF('Hole Survey'!$A$6:$A$105=\"\",1E+99,'Hole Survey'!$A$6:$A$105)-$B20)),ABS(IF('Hole Survey'!$A$6:$A$105=\"\",1E+99,'Hole Survey'!$A$6:$A$105)-$B20),0)))","v":""},{"$f":"IF($B20=\"\",\"\",INDEX('Hole Survey'!$B$6:$B$105,MATCH(MIN(ABS(IF('Hole Survey'!$A$6:$A$105=\"\",1E+99,'Hole Survey'!$A$6:$A$105)-$B20)),ABS(IF('Hole Survey'!$A$6:$A$105=\"\",1E+99,'Hole Survey'!$A$6:$A$105)-$B20),0)))","v":""},"","","","","",{"$error":"#VALUE!"},{"$error":"#VALUE!"},{"$error":"#VALUE!"},{"$error":"#VALUE!"},{"$error":"#VALUE!"},{"$error":"#VALUE!"},{"$error":"#VALUE!"},{"$error":"#VALUE!"},{"$error":"#VALUE!"},{"$error":"#VALUE!"},{"$error":"#VALUE!"},{"$error":"#VALUE!"},{"$error":"#VALUE!"},{"$error":"#VALUE!"},{"$error":"#VALUE!"},{"$error":"#VALUE!"},{"$error":"#VALUE!"},{"$error":"#VALUE!"},{"$error":"#VALUE!"},{"$error":"#VALUE!"},{"$error":"#VALUE!"},{"$error":"#VALUE!"},{"$error":"#VALUE!"},"Hole trend out of range (0-359); Hole inclination out of range (-90 to 90); "]
{"$rows_left_out":489}
{"sheet":"Read Me","index":2,"n_rows":12,"n_cols":1,"rows_kept":12,"cut":false,"hidden":false,"merged":[]}
["How to use this workbook"]
[]
["0. Paste hole survey data into the Hole Survey sheet. This will be used to match the measured structures to the nearest survey point."]
["1. Go to the Calculator sheet."]
["2. For a single measurement, type alpha, beta, gamma, hole trend and hole inclination into the input cells of row 9."]
["3. For many measurements, paste your table into the input columns (alpha..inclination) starting at row 9 (ID column is optional but strongly recommended. If your data does not output one, HoleID_depth is suggested...as long as depths are unique.). The data area is a proper Excel Table, so the Dip / Dip Azimuth / Trend / Plunge formulas and all the hidden working columns are carried down automatically onto every row you paste.  The table comes with 500 rows of formulas ready to go. You can paste up to 500 rows straight away. If you need more, see note 9 below."]
["4. Read the results in the green columns: Dip, Dip Azimuth, Lineation Trend, Lineation Plunge. Lineation Trend/Plunge are only produced when a Gamma value is present (it describes a lineation in the plane)."]
["5. The Warnings column flags any input outside its expected range (alpha 0-90, beta/gamma 0-359, hole trend 0-359, hole inclination -90 to 90). The calculation still runs - this is a data-entry check, not a hard limit. Out-of-range input cells are also highlighted red. If you type a value manually (not pasted) outside the expected range, Excel will also pop up a Yes/No warning before accepting it."]
["6. Hole inclination convention (industry standard): NEGATIVE = below horizontal (downward hole), POSITIVE = above horizontal (upward/raise hole), 0 = horizontal. A hole shot at -60 is 60 deg below horizontal."]
["7. The sheet is protected: the input columns and the two settings cells are editable, but the formulas, outputs and headers are locked so they can't be overwritten by accident. There is no password - to make structural changes use Review > Unprotect Sheet. Grey working columns (the ENU vector maths) are grouped and hidden; click the '+' above them to expand and audit. The Equations sheet lists the same maths."]
["8. Sense toggles (cells E5/E6) flip beta/gamma if your orientation tool measures counter-clockwise."]
["9. Need more than 500 rows? The table only auto-grows beyond its current size while the sheet is unprotected (Review > Unprotect Sheet) - then pasting below the table extends it and carries the formulas down. Re-protect afterwards if you like. Within the existing 500 rows no unprotecting is needed."]